Target
Monoglyceride lipase
Ligand
BDBM50250855
Substrate
Meas. Tech.
ChEBML_1682364
IC50
0.300000±n/a nM
Citation
 Butler, CRBeck, EMHarris, AHuang, ZMcAllister, LAAm Ende, CWFennell, KFoley, TLFonseca, KHawrylik, SJJohnson, DSKnafels, JDMente, SNoell, GSPandit, JPhillips, TBPiro, JRRogers, BNSamad, TAWang, JWan, SBrodney, MA Azetidine and Piperidine Carbamates as Efficient, Covalent Inhibitors of Monoacylglycerol Lipase. J Med Chem 60:9860-9873 (2017)  
Target
Name:
Monoglyceride lipase
Synonyms:
HU-K5 Lysophospholipase-like MGL MGLL_HUMAN
Type:
Hydrolase
Mol. Mass.:
33264.56
Organism:
Homo sapiens (Human)
Description:
Human recombinant MGL (Cayman Chemical, cat# 10008354).
Residue:
303
  
Inhibitor
Name:
BDBM50250855
Synonyms:
CHEMBL4077745
Type:
Small organic molecule
Emp. Form.:
C22H17F6N3O2
Mol. Mass.:
469.3797
SMILES:
FC(F)(F)C(OC(=O)N1CC(C1)c1cc(-c2ccccc2)n(n1)-c1ccccc1)C(F)(F)F
: