Target
Chitinase
Ligand
BDBM50254176
Substrate
Meas. Tech.
ChEBML_1686168
Ki
14100±n/a nM
Citation
 Maccari, GDeodato, DFiorucci, DOrofino, FTruglio, GIPasero, CMartini, RDe Luca, FDocquier, JDBotta, M Design and synthesis of a novel inhibitor of T. Viride chitinase through an in silico target fishing protocol. Bioorg Med Chem Lett 27:3332-3336 (2017)  
Target
Name:
Chitinase
Synonyms:
Chitinase | Endochitinase
Type:
PROTEIN
Mol. Mass.:
46280.30
Organism:
Hypocrea rufa
Description:
ChEMBL_117588
Residue:
424
  
Inhibitor
Name:
BDBM50254176
Synonyms:
CHEMBL3040884
Type:
Small organic molecule
Emp. Form.:
C28H47N7O2
Mol. Mass.:
513.7185
SMILES:
C\C=C\CNC(=N)NCCCCCCCCN1CCCCCCOc2ccccc2CNC(=N)NC1=O
: