Target
Retinal rod rhodopsin-sensitive cGMP 3',5'-cyclic phosphodiesterase subunit delta
Ligand
BDBM50256244
Substrate
Meas. Tech.
ChEBML_1687628
Kd
29±n/a nM
Citation
 Chen, LZhuang, CLu, JJiang, YSheng, C Discovery of Novel KRAS-PDE? Inhibitors by Fragment-Based Drug Design. J Med Chem 61:2604-2610 (2018)  
Target
Name:
Retinal rod rhodopsin-sensitive cGMP 3',5'-cyclic phosphodiesterase subunit delta
Synonyms:
3',5'-cyclic phosphodiesterase PDE6D PDED Retinal rod rhodopsin-sensitive cGMP 3',5'-cyclic phosphodiesterase subunit delta
Type:
PROTEIN
Mol. Mass.:
17418.30
Organism:
Homo sapiens (Human)
Description:
ChEMBL_105761
Residue:
150
  
Inhibitor
Name:
BDBM50256244
Synonyms:
CHEMBL4077358
Type:
Small organic molecule
Emp. Form.:
C31H25FN4O2
Mol. Mass.:
504.5542
SMILES:
Fc1ccccc1C1Nc2ccccc2C(=O)N1c1ccc(OCCn2ccnc2-c2ccccc2)cc1
: