Target
Bromodomain-containing protein 7
Ligand
BDBM342597
Substrate
Meas. Tech.
ChEBML_1687833
IC50
>1000±n/a nM
Citation
 Hasvold, LASheppard, GSWang, LFidanze, SDLiu, DPratt, JKMantei, RAWada, CKHubbard, RShen, YLin, XHuang, XWarder, SEWilcox, DLi, LBuchanan, FGSmithee, LAlbert, DHMagoc, TJPark, CHPetros, AMPanchal, SCSun, CKovar, PSoni, NBElmore, SWKati, WMMcDaniel, KF Methylpyrrole inhibitors of BET bromodomains. Bioorg Med Chem Lett 27:2225-2233 (2017)  
Target
Name:
Bromodomain-containing protein 7
Synonyms:
75 kDa bromodomain protein BRD7 CELTIX1 | Protein CELTIX-1
Type:
PROTEIN
Mol. Mass.:
74135.71
Organism:
Homo sapiens (Human)
Description:
ChEMBL_107970
Residue:
651
  
Inhibitor
Name:
BDBM342597
Synonyms:
N-[3-(3-methyl-4-oxo-4,5,6,7-tetrahydro-2H-isoindol-1-yl)-4-phenoxyphenyl]methanesulfonamide | US9776990, Example 40
Type:
Small organic molecule
Emp. Form.:
C22H22N2O4S
Mol. Mass.:
410.486
SMILES:
Cc1[nH]c(c2CCCC(=O)c12)-c1cc(NS(C)(=O)=O)ccc1Oc1ccccc1
: