Target
Oxoeicosanoid receptor 1
Ligand
BDBM50262197
Substrate
Meas. Tech.
ChEBML_1696692
IC50
23±n/a nM
Citation
 Ye, QChourey, SWang, RChintam, NRGravel, SPowell, WSRokach, J Structure-activity relationship study of?-oxidation resistant indole-based 5-oxo-6,8,11,14-eicosatetraenoic acid (5-oxo-ETE) receptor antagonists. Bioorg Med Chem Lett 27:4770-4776 (2017)  
Target
Name:
Oxoeicosanoid receptor 1
Synonyms:
5-oxo-ETE G-protein coupled receptor G-protein coupled receptor R527 GPR170 OXER1_HUMAN TG 1019 | TG1019
Type:
Enzyme Catalytic Domain
Mol. Mass.:
45833.20
Organism:
Homo sapiens (Human)
Description:
TG 1019 0 HUMAN::Q8TDS5
Residue:
423
  
Inhibitor
Name:
BDBM50262197
Synonyms:
CHEMBL4084871
Type:
Small organic molecule
Emp. Form.:
C26H38ClNO3
Mol. Mass.:
448.038
SMILES:
CCCCCCCCCCCc1c(C(=O)CC(C)CC(O)=O)c2cc(Cl)ccc2n1C
: