Target
Pancreatic triacylglycerol lipase
Ligand
BDBM23446
Substrate
Meas. Tech.
ChEBML_1696835
IC50
50400±n/a nM
Citation
 Jeong, GHCho, JHKim, SHKim, TH Plasma-induced dimerization of phloridzin as a new class of anti-adipogenic agents. Bioorg Med Chem Lett 27:4889-4892 (2017)  
Target
Name:
Pancreatic triacylglycerol lipase
Synonyms:
LIPP_PIG PNLIP Pancreatic lipase | Pancreatic triacylglycerol lipase
Type:
Enzyme
Mol. Mass.:
50080.69
Organism:
Sus scrofa (Pig)
Description:
P00591
Residue:
450
  
Inhibitor
Name:
BDBM23446
Synonyms:
3-(4-hydroxyphenyl)-1-(2,4,6-trihydroxyphenyl)propan-1-one Phloretin | cid_4788
Type:
Dihydrochalcone
Emp. Form.:
C15H14O5
Mol. Mass.:
274.2687
SMILES:
Oc1ccc(CCC(=O)c2c(O)cc(O)cc2O)cc1
: