Target
5-hydroxytryptamine receptor 2B
Ligand
BDBM50341448
Substrate
Meas. Tech.
ChEBML_1696905
Ki
20±n/a nM
Citation
 Procopiou, PAFord, AJGore, PMHancock, APHodgson, STHolmes, DSLooker, BEVile, SClark, KLSaunders, KASlack, RJWatts, CJ Identification of selective 8-(piperidin-4-yloxy)quinoline sulfone and sulfonamide histamine H Bioorg Med Chem Lett 27:4914-4919 (2017)  
Target
Name:
5-hydroxytryptamine receptor 2B
Synonyms:
5-HT-2B 5-hydroxytryptamine (serotonin) receptor 2B [Homo sapiens] 5-hydroxytryptamine receptor 2C (5HT2C) HTR2B Serotonin 2b (5-HT2b) receptor | Serotonin Receptor 2B
Type:
G Protein-Coupled Receptor (GPCR)
Mol. Mass.:
54312.47
Organism:
Homo sapiens (Human)
Description:
Receptor binding assays were performed using human clone stably expressed in CHO cells.
Residue:
481
  
Inhibitor
Name:
BDBM50341448
Synonyms:
4-(4-Chloro-benzyl)-2-(1-methyl-azepan-4-yl)-2H-phthalazin-1-one Astelin CHEMBL639 Optivar US20230414632, Compound II-a | rac-Azelastine
Type:
Small organic molecule
Emp. Form.:
C22H24ClN3O
Mol. Mass.:
381.898
SMILES:
CN1CCCC(CC1)n1nc(Cc2ccc(Cl)cc2)c2ccccc2c1=O
: