Target
D(4) dopamine receptor
Ligand
BDBM50257034
Substrate
Meas. Tech.
ChEMBL_1697995 (CHEMBL4048885)
Ki
0.331131±n/a nM
Citation
 Del Bello, FBonifazi, AGiorgioni, GCifani, CMicioni Di Bonaventura, MVPetrelli, RPiergentili, AFontana, SMammoli, VYano, HMatucci, RVistoli, GQuaglia, W 1-[3-(4-Butylpiperidin-1-yl)propyl]-1,2,3,4-tetrahydroquinolin-2-one (77-LH-28-1) as a Model for the Rational Design of a Novel Class of Brain Penetrant Ligands with High Affinity and Selectivity for Dopamine D J Med Chem 61:3712-3725 (2018)  
Target
Name:
D(4) dopamine receptor
Synonyms:
D(2C) dopamine receptor DOPAMINE D4.2 DRD4 Dopamine D4 receptor
Type:
Enzyme
Mol. Mass.:
48373.19
Organism:
Homo sapiens (Human)
Description:
P21917
Residue:
419
  
Inhibitor
Name:
BDBM50257034
Synonyms:
CHEMBL4096543
Type:
Small organic molecule
Emp. Form.:
C21H28IN3O
Mol. Mass.:
465.371
SMILES:
CC(C)Oc1cccnc1N(C)C1CCN(Cc2ccc(I)cc2)CC1
: