Target
4-hydroxyphenylpyruvate dioxygenase
Ligand
BDBM50075318
Substrate
Meas. Tech.
ChEMBL_1698544 (CHEMBL4049526)
IC50
250±n/a nM
Citation
 Santucci, ABernardini, GBraconi, DPetricci, EManetti, F 4-Hydroxyphenylpyruvate Dioxygenase and Its Inhibition in Plants and Animals: Small Molecules as Herbicides and Agents for the Treatment of Human Inherited Diseases. J Med Chem 60:4101-4125 (2017)  
Target
Name:
4-hydroxyphenylpyruvate dioxygenase
Synonyms:
1.13.11.27 4-hydroxyphenylpyruvic acid oxidase HPD PDS1
Type:
PROTEIN
Mol. Mass.:
48808.34
Organism:
Arabidopsis thaliana
Description:
ChEMBL_105530
Residue:
445
  
Inhibitor
Name:
BDBM50075318
Synonyms:
2-(2-Chloro-4-methanesulfonyl-benzoyl)-3-hydroxy-cyclohex-2-enone | CHEMBL73467
Type:
Small organic molecule
Emp. Form.:
C14H13ClO5S
Mol. Mass.:
328.768
SMILES:
CS(=O)(=O)c1ccc(C(=O)C2C(=O)CCCC2=O)c(Cl)c1
: