Target
Cytochrome P450 2B6
Ligand
BDBM50266122
Substrate
Meas. Tech.
ChEMBL_1700527 (CHEMBL4051509)
IC50
>10000±n/a nM
Citation
 Antczak, MIZhang, YWang, CDoran, JNaidoo, JVoruganti, SWilliams, NSMarkowitz, SDReady, JM Inhibitors of 15-Prostaglandin Dehydrogenase To Potentiate Tissue Repair. J Med Chem 60:3979-4001 (2017)  
Target
Name:
Cytochrome P450 2B6
Synonyms:
CP2B6_HUMAN Cytochrome P450 2B6 (CYP2B6)
Type:
Protein
Mol. Mass.:
56289.75
Organism:
Homo sapiens (Human)
Description:
P20813
Residue:
491
  
Inhibitor
Name:
BDBM50266122
Synonyms:
CHEMBL4070789
Type:
Small organic molecule
Emp. Form.:
C19H21N5OS3
Mol. Mass.:
431.598
SMILES:
CCCC[S@@+]([O-])c1sc2nc(cc(-c3cnc(C)n3C)c2c1N)-c1nccs1
: