Target
Cytochrome P450 2C19
Ligand
BDBM50266122
Substrate
Meas. Tech.
ChEMBL_1700530 (CHEMBL4051512)
IC50
>10000±n/a nM
Citation
 Antczak, MIZhang, YWang, CDoran, JNaidoo, JVoruganti, SWilliams, NSMarkowitz, SDReady, JM Inhibitors of 15-Prostaglandin Dehydrogenase To Potentiate Tissue Repair. J Med Chem 60:3979-4001 (2017)  
Target
Name:
Cytochrome P450 2C19
Synonyms:
CP2CJ_HUMAN CYPIIC17 Cytochrome P450 2C19 (CYP2C19) Mephenytoin 4-hydroxylase P450-254C
Type:
Enzyme
Mol. Mass.:
55935.47
Organism:
Homo sapiens (Human)
Description:
P33261
Residue:
490
  
Inhibitor
Name:
BDBM50266122
Synonyms:
CHEMBL4070789
Type:
Small organic molecule
Emp. Form.:
C19H21N5OS3
Mol. Mass.:
431.598
SMILES:
CCCC[S@@+]([O-])c1sc2nc(cc(-c3cnc(C)n3C)c2c1N)-c1nccs1
: