Target
Dihydrofolate reductase
Ligand
BDBM22985
Substrate
Meas. Tech.
ChEMBL_1704985 (CHEMBL4056218)
IC50
30±n/a nM
Citation
 Thakkar, SSThakor, PDoshi, HRay, A 1,2,4-Triazole and 1,3,4-oxadiazole analogues: Synthesis, MO studies, in silico molecular docking studies, antimalarial as DHFR inhibitor and antimicrobial activities. Bioorg Med Chem 25:4064-4075 (2017)  
Target
Name:
Dihydrofolate reductase
Synonyms:
DHFR Dihydrofolate reductase | Dihydrofolate reductase (DHFR)
Type:
Enzyme
Mol. Mass.:
21603.71
Organism:
Bos taurus (Cattle)
Description:
P00376
Residue:
187
  
Inhibitor
Name:
BDBM22985
Synonyms:
Aralen CHLOROQUINE PHOSPHATE Chloroquine med.21724, Compound 8 | {4-[(7-chloroquinolin-4-yl)amino]pentyl}diethylamine
Type:
Antimalarial
Emp. Form.:
C18H26ClN3
Mol. Mass.:
319.872
SMILES:
CCN(CC)CCCC(C)Nc1ccnc2cc(Cl)ccc12
: