Target
Protein mono-ADP-ribosyltransferase PARP14
Ligand
BDBM50272955
Substrate
Meas. Tech.
ChEMBL_1712750 (CHEMBL4122799)
IC50
776±n/a nM
Citation
 Holechek, JLease, RThorsell, AGKarlberg, TMcCadden, CGrant, RKeen, ACallahan, ESchüler, HFerraris, D Design, synthesis and evaluation of potent and selective inhibitors of mono-(ADP-ribosyl)transferases PARP10 and PARP14. Bioorg Med Chem Lett 28:2050-2054 (2018)  
Target
Name:
Protein mono-ADP-ribosyltransferase PARP14
Synonyms:
(ARTD8 or PARP14) 2.4.2.- ADP-ribosyltransferase diphtheria toxin-like 8 B aggressive lymphoma protein 2 BAL2  KIAA1268 PAR14_HUMAN PARP14 Synonyms=BAL2
Type:
Mol. Mass.:
202812.41
Organism:
Homo sapiens (Human)
Description:
Q460N5
Residue:
1801
  
Inhibitor
Name:
BDBM50272955
Synonyms:
CHEMBL4129001
Type:
Small organic molecule
Emp. Form.:
C24H22FN3O3
Mol. Mass.:
419.4482
SMILES:
NC(=O)c1ccc(Oc2cccc(c2)C(=O)N2CCN(CC2)c2ccc(F)cc2)cc1
: