Target
Lysine-specific demethylase PHF2
Ligand
BDBM18957
Substrate
Meas. Tech.
ChEMBL_1712928 (CHEMBL4122977)
IC50
84000±n/a nM
Citation
 Bhushan, BErdmann, AZhang, YBelle, RJohannson, COppermann, UHopkinson, RJSchofield, CJKawamura, A Investigations on small molecule inhibitors targeting the histone H3K4 tri-methyllysine binding PHD-finger of JmjC histone demethylases. Bioorg Med Chem 26:2984-2991 (2018)  
Target
Name:
Lysine-specific demethylase PHF2
Synonyms:
1.14.11.- GRC5 Lysine-specific demethylase PHF2 PHF2 | PHF2_HUMAN
Type:
PROTEIN
Mol. Mass.:
120820.94
Organism:
Homo sapiens
Description:
ChEMBL_117917
Residue:
1096
  
Inhibitor
Name:
BDBM18957
Synonyms:
(2-{4-[(2-butyl-1-benzofuran-3-yl)carbonyl]-2,6-diiodophenoxy}ethyl)diethylamine Amiodarone Cordarone cid_441325
Type:
Small organic molecule
Emp. Form.:
C25H29I2NO3
Mol. Mass.:
645.3116
SMILES:
CCCCc1oc2ccccc2c1C(=O)c1cc(I)c(OCCN(CC)CC)c(I)c1
: