Target
Beta-secretase 1
Ligand
BDBM134293
Substrate
Meas. Tech.
ChEMBL_1712905 (CHEMBL4122954)
IC50
70±n/a nM
Citation
 Veenstra, SJRueeger, HVoegtle, MLueoend, RHolzer, PHurth, KTintelnot-Blomley, MFrederiksen, MRondeau, JMJacobson, LStaufenbiel, MNeumann, UMachauer, R Discovery of amino-1,4-oxazines as potent BACE-1 inhibitors. Bioorg Med Chem Lett 28:2195-2200 (2018)  
Target
Name:
Beta-secretase 1
Synonyms:
ASP2 Aspartyl protease 2 BACE1 Beta-secretase (BACE) Beta-secretase 1 (BACE 1) Beta-secretase 1 (BACE1) Beta-site amyloid precursor protein cleaving enzyme 1 Memapsin-2 beta-Secretase (BACE-1) | beta-Secretase (BACE1)
Type:
Protein
Mol. Mass.:
55755.10
Organism:
Homo sapiens (Human)
Description:
P56817
Residue:
501
  
Inhibitor
Name:
BDBM134293
Synonyms:
US8846658, 3
Type:
Small organic molecule
Emp. Form.:
C17H17BrN4O2
Mol. Mass.:
389.246
SMILES:
C[C@]1(COCC(N)=N1)c1cccc(NC(=O)c2ccc(Br)cn2)c1
: