Target
Potassium voltage-gated channel subfamily H member 2
Ligand
BDBM50279595
Substrate
Meas. Tech.
ChEMBL_1721264 (CHEMBL4136264)
IC50
>30±n/a nM
Citation
 Huang, ZLi, HZhang, QLu, FHong, MZhang, ZGuo, XZhu, YLi, SLiu, H Discovery of Indolinone-Based Multikinase Inhibitors as Potential Therapeutics for Idiopathic Pulmonary Fibrosis. ACS Med Chem Lett 8:1142-1147 (2017)  
Target
Name:
Potassium voltage-gated channel subfamily H member 2
Synonyms:
1,3-beta-glucan synthase component GLS2 ERG Eag-related protein 1 Ether-a-go-go-related gene (HERG) Ether-a-go-go-related gene potassium channel 1 Ether-a-go-go-related gene potassium channel 1 (hERG1) Ether-a-go-go-related protein 1 H-ERG KCNH2 Potassium voltage-gated channel subfamily H member 2 (hERG) Voltage-gated potassium channel subunit Kv11.1 hERG Potassium Channel 1 | putative potassium channel subunit
Type:
Multi-pass membrane protein
Mol. Mass.:
126672.65
Organism:
Homo sapiens (Human)
Description:
Q12809
Residue:
1159
  
Inhibitor
Name:
BDBM50279595
Synonyms:
CHEMBL4165455
Type:
Small organic molecule
Emp. Form.:
C31H28N4O5
Mol. Mass.:
536.5778
SMILES:
COC(=O)c1ccc2\C(=C(\Nc3ccc4CCN(C(=O)CN5CCCC5=O)c4c3)c3ccccc3)C(=O)Nc2c1
: