Target
Amine oxidase [flavin-containing] A
Ligand
BDBM15579
Substrate
Meas. Tech.
ChEMBL_1726378 (CHEMBL4141656)
IC50
67250±n/a nM
Citation
 Carradori, SOrtuso, FPetzer, ABagetta, DDe Monte, CSecci, DDe Vita, DGuglielmi, PZengin, GAktumsek, AAlcaro, SPetzer, JP Design, synthesis and biochemical evaluation of novel multi-target inhibitors as potential anti-Parkinson agents. Eur J Med Chem 143:1543-1552 (2018)  
Target
Name:
Amine oxidase [flavin-containing] A
Synonyms:
AOFA_HUMAN MAO-A Monoamine oxidase Monoamine oxidase type A (MAO A) Monoamine oxidase type A (MAOA)
Type:
Protein
Mol. Mass.:
59689.53
Organism:
Homo sapiens (Human)
Description:
P21397
Residue:
527
  
Inhibitor
Name:
BDBM15579
Synonyms:
CHEMBL972 L-Deprenyl SLG US8633208, Deprenyl methyl[(2R)-1-phenylpropan-2-yl]prop-2-yn-1-ylamine
Type:
Small organic molecule
Emp. Form.:
C13H17N
Mol. Mass.:
187.2808
SMILES:
C[C@H](Cc1ccccc1)N(C)CC#C
: