Target
Bile acid receptor
Ligand
BDBM50286733
Substrate
Meas. Tech.
ChEMBL_1729516 (CHEMBL4144794)
IC50
0.060000±n/a nM
Citation
 Teno, NYamashita, YIguchi, YFujimori, KUne, MNishimaki-Mogami, THiramoto, TGohda, K Nonacidic Chemotype Possessing  ACS Med Chem Lett 9:78-83 (2018)  
Target
Name:
Bile acid receptor
Synonyms:
BAR FXR HRR1 NR1H4_HUMAN RIP14 Retinoid X receptor-interacting protein 14 | farnesoid x receptor
Type:
Nuclear Receptor
Mol. Mass.:
55916.24
Organism:
Homo sapiens (Human)
Description:
Q96RI1
Residue:
486
  
Inhibitor
Name:
BDBM50286733
Synonyms:
CHEMBL4162312
Type:
Small organic molecule
Emp. Form.:
C34H36FN5O4
Mol. Mass.:
597.6791
SMILES:
CC(C)C(=O)N1CCC(C[C@H](N2C(=O)CN(C2=O)c2ccc(Oc3ccccc3)cc2)c2nc3cc(F)ccc3n2C)CC1
: