Target
Diacylglycerol O-acyltransferase 1
Ligand
BDBM50287311
Substrate
Meas. Tech.
ChEMBL_1729642 (CHEMBL4144920)
IC50
1.000000±n/a nM
Citation
 Cheung, MTangirala, RSBethi, SRJoshi, HVAriazi, JLTirunagaru, VGKumar, S Discovery of Tetralones as Potent and Selective Inhibitors of Acyl-CoA:Diacylglycerol Acyltransferase 1. ACS Med Chem Lett 9:103-108 (2018)  
Target
Name:
Diacylglycerol O-acyltransferase 1
Synonyms:
ACAT-related gene product 1 Acyl coA-diacylglycerol acyl transferase 1 (DGAT1) DGAT1 Diacylglycerol Acyltransferase (DGAT1) Diacylglycerol O-acyltransferase 1 (DGAT1) | Diglyceride acyltransferase
Type:
Protein
Mol. Mass.:
55297.82
Organism:
Homo sapiens (Human)
Description:
O75907
Residue:
488
  
Inhibitor
Name:
BDBM50287311
Synonyms:
CHEMBL4176968
Type:
Small organic molecule
Emp. Form.:
C28H25F3N2O4
Mol. Mass.:
510.5043
SMILES:
CC[C@@]1(CC(O)=O)CCc2cc(ccc2C1=O)-c1ccc(NC(=O)Nc2cccc(c2)C(F)(F)F)cc1
: