Target
ATP-sensitive inward rectifier potassium channel 1
Ligand
BDBM50287519
Substrate
Meas. Tech.
ChEMBL_1729715 (CHEMBL4144993)
IC50
35±n/a nM
Citation
 Sammons, MFKharade, SVFilipski, KJBoehm, MSmith, ACShavnya, AFernando, DPDowling, MSCarpino, PACastle, NAZellmer, SGAntonio, BMGosset, JRCarlo, ADenton, JS Discovery and in Vitro Optimization of 3-Sulfamoylbenzamides as ROMK Inhibitors. ACS Med Chem Lett 9:125-130 (2018)  
Target
Name:
ATP-sensitive inward rectifier potassium channel 1
Synonyms:
ATP-regulated potassium channel ROM-K ATP-sensitive inward rectifier potassium channel 1 KCNJ1 Potassium channel (ATP modulatory) ROMK1 The Renal Outer Medullary Potassium (ROMK)
Type:
Enzyme Catalytic Domain
Mol. Mass.:
44809.08
Organism:
Homo sapiens (Human)
Description:
gi_223460826
Residue:
391
  
Inhibitor
Name:
BDBM50287519
Synonyms:
CHEMBL4172084
Type:
Small organic molecule
Emp. Form.:
C21H19N5O5S
Mol. Mass.:
453.471
SMILES:
Cc1noc(CNC(=O)c2ccc(C)c(c2)S(=O)(=O)Nc2ccc(cc2)-c2cnco2)n1
: