Target
Excitatory amino acid transporter 2
Ligand
BDBM18125
Substrate
Meas. Tech.
ChEMBL_1735431 (CHEMBL4150967)
IC50
32000±n/a nM
Citation
 Fu, HZhang, JTepper, PGBunch, LJensen, AAPoelarends, GJ Chemoenzymatic Synthesis and Pharmacological Characterization of Functionalized Aspartate Analogues As Novel Excitatory Amino Acid Transporter Inhibitors. J Med Chem 61:7741-7753 (2018)  
Target
Name:
Excitatory amino acid transporter 2
Synonyms:
EAA2_HUMAN GLT1 SLC1A2 Solute carrier family 1 member 2
Type:
Enzyme Catalytic Domain
Mol. Mass.:
62103.57
Organism:
Homo sapiens (Human)
Description:
Excitatory Amino Acid EAAT2 0 0::P43004
Residue:
574
  
Inhibitor
Name:
BDBM18125
Synonyms:
(2S)-2-aminobutanedioic acid CHEMBL274323 L-Aspartic acid, 2 | L-[14C]aspartate
Type:
Amino Acid
Emp. Form.:
C4H7NO4
Mol. Mass.:
133.1027
SMILES:
N[C@@H](CC(O)=O)C(O)=O
: