Target
Catechol O-methyltransferase
Ligand
BDBM50017848
Substrate
Meas. Tech.
ChEBML_47065
IC50
18±n/a nM
Citation
 Bäckström, RHonkanen, EPippuri, AKairisalo, PPystynen, JHeinola, KNissinen, ELinden, IBMännistö, PTKaakkola, S Synthesis of some novel potent and selective catechol O-methyltransferase inhibitors. J Med Chem 32:841-6 (1989)  
Target
Name:
Catechol O-methyltransferase
Synonyms:
COMT_RAT Catechol-O-methyltransferase | Comt
Type:
Enzyme
Mol. Mass.:
29594.09
Organism:
Rattus norvegicus (Rat)
Description:
Residue:
264
  
Inhibitor
Name:
BDBM50017848
Synonyms:
3-(3,4-Dihydroxy-5-nitro-benzylidene)-pentane-2,4-dione Nitecapone
Type:
Small organic molecule
Emp. Form.:
C12H11NO6
Mol. Mass.:
265.2188
SMILES:
[#6]-[#6](=O)-[#6](=[#6]/c1cc(-[#8])c(-[#8])c(c1)-[#7+](-[#8-])=O)\[#6](-[#6])=O
: