Target
Catechol O-methyltransferase
Ligand
BDBM50017857
Substrate
Meas. Tech.
ChEBML_47065
IC50
6±n/a nM
Citation
 Bäckström, RHonkanen, EPippuri, AKairisalo, PPystynen, JHeinola, KNissinen, ELinden, IBMännistö, PTKaakkola, S Synthesis of some novel potent and selective catechol O-methyltransferase inhibitors. J Med Chem 32:841-6 (1989)  
Target
Name:
Catechol O-methyltransferase
Synonyms:
COMT_RAT Catechol-O-methyltransferase | Comt
Type:
Enzyme
Mol. Mass.:
29594.09
Organism:
Rattus norvegicus (Rat)
Description:
Residue:
264
  
Inhibitor
Name:
BDBM50017857
Synonyms:
3-(3,4-Dihydroxy-5-nitro-phenyl)-1-phenyl-propenone | CHEMBL169926
Type:
Small organic molecule
Emp. Form.:
C15H11NO5
Mol. Mass.:
285.2515
SMILES:
Oc1cc(\C=C\C(=O)c2ccccc2)cc(c1O)[N+]([O-])=O
: