Target
Bromodomain testis-specific protein
Ligand
BDBM50103503
Substrate
Meas. Tech.
ChEMBL_1737375 (CHEMBL4153125)
IC50
708±n/a nM
Citation
 Liu, ZTian, BChen, HWang, PBrasier, ARZhou, J Discovery of potent and selective BRD4 inhibitors capable of blocking TLR3-induced acute airway inflammation. Eur J Med Chem 151:450-461 (2018)  
Target
Name:
Bromodomain testis-specific protein
Synonyms:
BRDT Bromodomain and extra-terminal motif (BET) Cancer/testis antigen 9 | RING3-like protein
Type:
PROTEIN
Mol. Mass.:
107982.01
Organism:
Homo sapiens (Human)
Description:
ChEMBL_1502985
Residue:
947
  
Inhibitor
Name:
BDBM50103503
Synonyms:
CHEMBL2393130 | US11117865, Compound RVX-208
Type:
Small organic molecule
Emp. Form.:
C20H22N2O5
Mol. Mass.:
370.3991
SMILES:
COc1cc(OC)c2c(c1)nc([nH]c2=O)-c1cc(C)c(OCCO)c(C)c1
: