Target
Adenosine receptor A2a
Ligand
BDBM21190
Substrate
Meas. Tech.
ChEMBL_1740326 (CHEMBL4156076)
IC50
0.830000±n/a nM
Citation
 Varano, FCatarzi, DVincenzi, FFalsini, MPasquini, SBorea, PAColotta, VVarani, K Structure-activity relationship studies and pharmacological characterization of N Eur J Med Chem 155:552-561 (2018)  
Target
Name:
Adenosine receptor A2a
Synonyms:
A2A adenosine receptor (hA2A) ADENOSINE A2 ADORA2 Adenosine A2A receptor (A2AAR)
Type:
G Protein-Coupled Receptor (GPCR)
Mol. Mass.:
44716.46
Organism:
Homo sapiens (Human)
Description:
P29274
Residue:
412
  
Inhibitor
Name:
BDBM21190
Synonyms:
4-(2-{[5-amino-2-(furan-2-yl)-[1,2,4]triazolo[1,5-a][1,3,5]triazin-7-yl]amino}ethyl)phenol ZM 241385 [3H]-ZM241385
Type:
Small organic molecule
Emp. Form.:
C16H15N7O2
Mol. Mass.:
337.336
SMILES:
Nc1nc(NCCc2ccc(O)cc2)nc2nc(nn12)-c1ccco1
: