Target
Voltage-dependent T-type calcium channel subunit alpha-1H
Ligand
BDBM50452258
Substrate
Meas. Tech.
ChEMBL_1747210 (CHEMBL4181720)
IC50
7.0±n/a nM
Citation
 Bezençon, OHeidmann, BSiegrist, RStamm, SRichard, SPozzi, DCorminboeuf, ORoch, CKessler, MErtel, EAReymond, IPfeifer, Tde Kanter, RToeroek-Schafroth, MMoccia, LGMawet, JMoon, RRey, MCapeleto, BFournier, E Discovery of a Potent, Selective T-type Calcium Channel Blocker as a Drug Candidate for the Treatment of Generalized Epilepsies. J Med Chem 60:9769-9789 (2017)  
Target
Name:
Voltage-dependent T-type calcium channel subunit alpha-1H
Synonyms:
CAC1H_HUMAN Low-voltage-activated calcium channel alpha1 3.2 subunit Voltage-gated calcium channel voltage-dependent T-type calcium channel subunit alpha-1H isoform a
Type:
Enzyme Catalytic Domain
Mol. Mass.:
259187.68
Organism:
Homo sapiens (Human)
Description:
Calcium channel (Type T,L) 0 0::O95180
Residue:
2353
  
Inhibitor
Name:
BDBM50452258
Synonyms:
CHEMBL4208907
Type:
Small organic molecule
Emp. Form.:
C21H18F3N5O2
Mol. Mass.:
429.3951
SMILES:
Cc1cc(CC(=O)Nc2ccn(Cc3ccc(cn3)C#N)n2)ccc1OCC(F)(F)F
: