Target
5-hydroxytryptamine receptor 1A
Ligand
BDBM50020578
Substrate
Meas. Tech.
ChEMBL_583 (CHEMBL615453)
Ki
18±n/a nM
Citation
 Chumpradit, SKung, HFBillings, JGuo, YZWu, YShih, J Preparation and biodistribution of 1-[2-(3-[125I]iodo-4-aminophenyl)ethyl]-4-[3-(trifluoromethyl) phenyl]piperazine and 1-[2-(3-[125I]iodo-4-azidophenyl)ethyl]-4-[3-(trifluoromethyl)phenyl] piperazine. J Med Chem 32:543-7 (1989)  
Target
Name:
5-hydroxytryptamine receptor 1A
Synonyms:
5-HT-1A 5-hydroxytryptamine receptor 1A (5-HT-1A) ADRB2RL1 Dopamine D2 receptor and serotonin 1a receptor HTR1A | Serotonin receptor 1A
Type:
Mol. Mass.:
46122.49
Organism:
Homo sapiens (Human)
Description:
Residue:
422
  
Inhibitor
Name:
BDBM50020578
Synonyms:
1-[2-(4-Azido-3-iodo-phenyl)-ethyl]-4-(3-trifluoromethyl-phenyl)-piperazine | CHEMBL155615
Type:
Small organic molecule
Emp. Form.:
C19H19F3IN5
Mol. Mass.:
501.2873
SMILES:
FC(F)(F)c1cccc(c1)N1CCN(CCc2ccc(N=[N+]=[N-])c(I)c2)CC1
: