Target
Reverse transcriptase
Ligand
BDBM2483
Substrate
Meas. Tech.
ChEMBL_1752567 (CHEMBL4187327)
EC50
38±n/a nM
Citation
 Monforte, AMDe Luca, LBuemi, MRAgharbaoui, FEPannecouque, CFerro, S Structural optimization of N Bioorg Med Chem 26:661-674 (2018)  
Target
Name:
Reverse transcriptase
Synonyms:
Type:
Protein
Mol. Mass.:
29598.37
Organism:
Human immunodeficiency virus 1
Description:
Q9WKE8
Residue:
254
  
Inhibitor
Name:
BDBM2483
Synonyms:
(4S)-6-chloro-4-(2-cyclopropylethynyl)-4-(trifluoromethyl)-2,4-dihydro-1H-3,1-benzoxazin-2-one DMP-266 Efavirenz L-743,726 | Sustiva
Type:
Small organic molecule
Emp. Form.:
C14H9ClF3NO2
Mol. Mass.:
315.675
SMILES:
FC(F)(F)[C@]1(OC(=O)Nc2ccc(Cl)cc12)C#CC1CC1
: