Target
Mineralocorticoid receptor
Ligand
BDBM50354850
Substrate
Meas. Tech.
ChEMBL_1755057 (CHEMBL4189817)
EC50
4.8±n/a nM
Citation
 Ghidini, EMarchini, GCapelli, AMCarnini, CCenacchi, VFioni, AFacchinetti, FRancati, F Novel Pyrrolidine Derivatives of Budesonide as Long Acting Inhaled Corticosteroids for the Treatment of Pulmonary Inflammatory Diseases. J Med Chem 61:4757-4773 (2018)  
Target
Name:
Mineralocorticoid receptor
Synonyms:
MCR MLR NR3C2 | Nuclear receptor subfamily 3 group C member 2
Type:
Enzyme
Mol. Mass.:
107076.42
Organism:
Homo sapiens (Human)
Description:
P08235
Residue:
984
  
Inhibitor
Name:
BDBM50354850
Synonyms:
BUDESONIDE US11554172, Compound Budesonide | US11760775, Compound Budesonide
Type:
Small organic molecule
Emp. Form.:
C25H34O6
Mol. Mass.:
430.5339
SMILES:
CCCC1O[C@@H]2C[C@H]3[C@@H]4CCC5=CC(=O)C=C[C@]5(C)[C@H]4[C@@H](O)C[C@]3(C)[C@@]2(O1)C(=O)CO
: