Target
Alpha-galactosidase
Ligand
BDBM50456590
Substrate
Meas. Tech.
ChEMBL_1757450 (CHEMBL4192458)
IC50
14000±n/a nM
Citation
 Martínez-Bailén, MCarmona, ATMoreno-Clavijo, ERobina, IIde, DKato, AMoreno-Vargas, AJ Tuning of ?-glucosidase and ?-galactosidase inhibition by generation and in situ screening of a library of pyrrolidine-triazole hybrid molecules. Eur J Med Chem 138:532-542 (2017)  
Target
Name:
Alpha-galactosidase
Synonyms:
α-galactosidase Alpha-galactosidase
Type:
Protein
Mol. Mass.:
41306.82
Organism:
Coffea arabica (Coffee beans)
Description:
Residue:
378
  
Inhibitor
Name:
BDBM50456590
Synonyms:
CHEMBL4206239
Type:
Small organic molecule
Emp. Form.:
C13H16N4O2
Mol. Mass.:
260.2917
SMILES:
O[C@@H]1CN[C@H](Cn2cc(nn2)-c2ccccc2)[C@@H]1O
: