Target
Adenosine receptor A2a
Ligand
BDBM50457098
Substrate
Meas. Tech.
ChEMBL_1758724 (CHEMBL4193732)
Ki
0.060000±n/a nM
Target
Name:
Adenosine receptor A2a
Synonyms:
A2A adenosine receptor (hA2A) ADENOSINE A2 ADORA2 Adenosine A2A receptor (A2AAR)
Type:
G Protein-Coupled Receptor (GPCR)
Mol. Mass.:
44716.46
Organism:
Homo sapiens (Human)
Description:
P29274
Residue:
412
  
Inhibitor
Name:
BDBM50457098
Synonyms:
CHEMBL4217582
Type:
Small organic molecule
Emp. Form.:
C24H26FN9O3
Mol. Mass.:
507.5201
SMILES:
COc1ccc(N2CCN(CCn3c4nc(N)n5nc(nc5c4n(C)c3=O)-c3ccco3)CC2)c(F)c1
: