Target
Adenosine receptor A2a
Ligand
BDBM50457107
Substrate
Meas. Tech.
ChEMBL_1758725 (CHEMBL4193733)
Ki
0.420000±n/a nM
Target
Name:
Adenosine receptor A2a
Synonyms:
AA2AR_RAT Adenosine A2 receptor Adenosine Receptors A2a (A2a) Adenosine receptors A2a Rat striatal adenosine A2a receptor
Type:
G Protein-Coupled Receptor (GPCR)
Mol. Mass.:
45015.65
Organism:
Rattus norvegicus (rat)
Description:
Rat A2A receptors expressed in CHO cells.
Residue:
410
  
Inhibitor
Name:
BDBM50457107
Synonyms:
CHEMBL4209408
Type:
Small organic molecule
Emp. Form.:
C27H33N9O4
Mol. Mass.:
547.6088
SMILES:
COCC(C)Oc1ccc(cc1)N1CCN(CCn2c3nc(N)n4nc(nc4c3n(C)c2=O)-c2ccco2)CC1
: