Target
Beta-secretase 1
Ligand
BDBM50432632
Substrate
Meas. Tech.
ChEMBL_1760187 (CHEMBL4195195)
IC50
6.7±n/a nM
Citation
 Fuchino, KMitsuoka, YMasui, MKurose, NYoshida, SKomano, KYamamoto, TOgawa, MUnemura, CHosono, MIto, HSakaguchi, GAndo, SOhnishi, SKido, YFukushima, TMiyajima, HHiroyama, SKoyabu, KDhuyvetter, DBorghys, HGijsen, HJMYamano, YIso, YKusakabe, KI Rational Design of Novel 1,3-Oxazine Based ?-Secretase (BACE1) Inhibitors: Incorporation of a Double Bond To Reduce P-gp Efflux Leading to Robust A? Reduction in the Brain. J Med Chem 61:5122-5137 (2018)  
Target
Name:
Beta-secretase 1
Synonyms:
ASP2 Aspartyl protease 2 BACE1 Beta-secretase (BACE) Beta-secretase 1 (BACE 1) Beta-secretase 1 (BACE1) Beta-site amyloid precursor protein cleaving enzyme 1 Memapsin-2 beta-Secretase (BACE-1) | beta-Secretase (BACE1)
Type:
Protein
Mol. Mass.:
55755.10
Organism:
Homo sapiens (Human)
Description:
P56817
Residue:
501
  
Inhibitor
Name:
BDBM50432632
Synonyms:
CHEMBL2347211
Type:
Small organic molecule
Emp. Form.:
C17H16ClFN4OS
Mol. Mass.:
378.852
SMILES:
C[C@]1(CCSC(N)=N1)c1cc(NC(=O)c2ccc(Cl)cn2)ccc1F
: