Target
Adenosine receptor A2b
Ligand
BDBM50458360
Substrate
Meas. Tech.
ChEMBL_1763192 (CHEMBL4198439)
EC50
13±n/a nM
Citation
 Betti, MCatarzi, DVarano, FFalsini, MVarani, KVincenzi, FDal Ben, DLambertucci, CColotta, V The aminopyridine-3,5-dicarbonitrile core for the design of new non-nucleoside-like agonists of the human adenosine A Eur J Med Chem 150:127-139 (2018)  
Target
Name:
Adenosine receptor A2b
Synonyms:
AA2BR_HUMAN ADORA2B Adenosine receptors A2b | Adenosine receptors; A2a & A2b
Type:
G Protein-Coupled Receptor (GPCR)
Mol. Mass.:
36341.22
Organism:
Homo sapiens (Human)
Description:
Residue:
332
  
Inhibitor
Name:
BDBM50458360
Synonyms:
CHEMBL4214347
Type:
Small organic molecule
Emp. Form.:
C25H21N5O2S
Mol. Mass.:
455.532
SMILES:
NC(=O)c1cccc(CSc2nc(N)c(C#N)c(-c3ccc(OCC4CC4)cc3)c2C#N)c1
: