Target
Adenosine receptor A2b
Ligand
BDBM50458368
Substrate
Meas. Tech.
ChEMBL_1763192 (CHEMBL4198439)
EC50
51±n/a nM
Citation
 Betti, MCatarzi, DVarano, FFalsini, MVarani, KVincenzi, FDal Ben, DLambertucci, CColotta, V The aminopyridine-3,5-dicarbonitrile core for the design of new non-nucleoside-like agonists of the human adenosine A Eur J Med Chem 150:127-139 (2018)  
Target
Name:
Adenosine receptor A2b
Synonyms:
AA2BR_HUMAN ADORA2B Adenosine receptors A2b | Adenosine receptors; A2a & A2b
Type:
G Protein-Coupled Receptor (GPCR)
Mol. Mass.:
36341.22
Organism:
Homo sapiens (Human)
Description:
Residue:
332
  
Inhibitor
Name:
BDBM50458368
Synonyms:
CHEMBL4215091
Type:
Small organic molecule
Emp. Form.:
C20H17N7OS
Mol. Mass.:
403.46
SMILES:
Nc1nc(SCc2ncn[nH]2)c(C#N)c(-c2ccc(OCC3CC3)cc2)c1C#N
: