Target
Replicase polyprotein 1ab
Ligand
BDBM50458470
Substrate
Meas. Tech.
ChEMBL_1763459 (CHEMBL4198706)
IC50
28800±n/a nM
Citation
 Galasiti Kankanamalage, ACKim, YDamalanka, VCRathnayake, ADFehr, ARMehzabeen, NBattaile, KPLovell, SLushington, GHPerlman, SChang, KOGroutas, WC Structure-guided design of potent and permeable inhibitors of MERS coronavirus 3CL protease that utilize a piperidine moiety as a novel design element. Eur J Med Chem 150:334-346 (2018)  
Target
Name:
Replicase polyprotein 1ab
Synonyms:
3C-like proteinase 3C-like proteinase (SARS-CoV 3Cpro) 3CLp GFL Guanine-N7 methyltransferase Helicase Leader protein Non-structural protein 10 Non-structural protein 3 Non-structural protein 6 Non-structural protein 8 ORF1ab polyprotein PL2-PRO Pol R1AB_SARS RdRp SARS coronavirus main proteinase nsp1 nsp12 nsp14 nsp16 nsp3 nsp5 nsp7 nsp9 pp1ab | rep
Type:
Protein
Mol. Mass.:
790250.81
Organism:
Human SARS coronavirus (SARS-CoV) (Severe acute respiratory syndrome coronavirus)
Description:
P0C6X7
Residue:
7073
  
Inhibitor
Name:
BDBM50458470
Synonyms:
CHEMBL4209146
Type:
Small organic molecule
Emp. Form.:
C20H34N4O7S
Mol. Mass.:
474.572
SMILES:
CC(C)C[C@H](NC(=O)OC1CCN(CC1)S(C)(=O)=O)C(=O)N[C@@H](C[C@@H]1CCNC1=O)C=O
: