Target
Amine oxidase [flavin-containing] A
Ligand
BDBM50240772
Substrate
Meas. Tech.
ChEMBL_1768380 (CHEMBL4220492)
IC50
2500±n/a nM
Citation
 Ota, YMiyamura, SAraki, MItoh, YYasuda, SMasuda, MTaniguchi, TSowa, YSakai, TItami, KYamaguchi, JSuzuki, T Design, synthesis and evaluation of ?-turn mimetics as LSD1-selective inhibitors. Bioorg Med Chem 26:775-785 (2018)  
Target
Name:
Amine oxidase [flavin-containing] A
Synonyms:
AOFA_HUMAN MAO-A Monoamine oxidase Monoamine oxidase type A (MAO A) Monoamine oxidase type A (MAOA)
Type:
Protein
Mol. Mass.:
59689.53
Organism:
Homo sapiens (Human)
Description:
P21397
Residue:
527
  
Inhibitor
Name:
BDBM50240772
Synonyms:
(1R,2S)-(-)-2-phenylcyclopropylamine (tranylcypromine)2-Phenyl-cyclopropylamine CHEMBL1179 TRANYLCYPROMINE US10836743, Compound TCP US9180183, Tranylcypromine rel-Tranylcypromine
Type:
Small organic molecule
Emp. Form.:
C9H11N
Mol. Mass.:
133.1903
SMILES:
N[C@@H]1C[C@H]1c1ccccc1
: