Target
Genome polyprotein
Ligand
BDBM50462020
Substrate
Meas. Tech.
ChEMBL_1772460 (CHEMBL4224572)
IC50
550±n/a nM
Citation
 Jung, ELee, JYKim, HJRyu, CKLee, KIKim, MLee, CKGo, YY Identification of quinone analogues as potential inhibitors of picornavirus 3C protease in vitro. Bioorg Med Chem Lett 28:2533-2538 (2018)  
Target
Name:
Genome polyprotein
Synonyms:
3C-like proteinase (CVB3 3Cpro) P1A P1C P2A P2C P3B P3D-POL Picornain 3C Protease 2A Protein 2A Protein 2C Protein 3B Protein VP1 Protein VP3 RNA-directed RNA polymerase 3D-POL VPg Virion protein 2 Virion protein 4
Type:
Enzyme
Mol. Mass.:
243464.96
Organism:
Coxsackievirus B3 (strain Nancy)
Description:
P03313
Residue:
2185
  
Inhibitor
Name:
BDBM50462020
Synonyms:
CHEMBL515513
Type:
Small organic molecule
Emp. Form.:
C18H10Cl2N4O2
Mol. Mass.:
385.204
SMILES:
ClC1=C(Nc2cccc(Cl)c2)C(=O)c2[nH]c(nc2C1=O)-c1ccncc1
: