Target
Ribosomal protein S6 kinase alpha-6
Ligand
BDBM50462709
Substrate
Meas. Tech.
ChEMBL_1776414 (CHEMBL4233406)
IC50
>1000±n/a nM
Citation
 Gao, HMarhefka, CJacobs, MDCao, JBandarage, UKGreen, J ROCK inhibitors 2. Improving potency, selectivity and solubility through the application of rationally designed solubilizing groups. Bioorg Med Chem Lett 28:2616-2621 (2018)  
Target
Name:
Ribosomal protein S6 kinase alpha-6
Synonyms:
90 kDa ribosomal protein S6 kinase 6 RPS6KA6 RPS6KA6(Kin.Dom.2 - C-terminal) RSK4 Ribosomal S6 kinase 4 Ribosomal protein S6 kinase alpha 6 (RSK4) S6K-alpha 6 p90RSK | pp90RSK4
Type:
Serine/threonine-protein kinase
Mol. Mass.:
83868.06
Organism:
Homo sapiens (Human)
Description:
Residue:
745
  
Inhibitor
Name:
BDBM50462709
Synonyms:
CHEMBL4245507
Type:
Small organic molecule
Emp. Form.:
C23H27N5O2S
Mol. Mass.:
437.558
SMILES:
O=C(Cc1cccc(OCCCN2CCNCC2)c1)Nc1nc(cs1)-c1ccncc1
: