Target
Large neutral amino acids transporter small subunit 1
Ligand
BDBM50463321
Substrate
Meas. Tech.
ChEMBL_1778012 (CHEMBL4235004)
IC50
27700±n/a nM
Citation
 Thiele, NAKärkkäinen, JSloan, KBRautio, JHuttunen, KM Secondary carbamate linker can facilitate the sustained release of dopamine from brain-targeted prodrug. Bioorg Med Chem Lett 28:2856-2860 (2018)  
Target
Name:
Large neutral amino acids transporter small subunit 1
Synonyms:
4F2 LC 4F2LC CD98LC Integral membrane protein E16 LAT1 Large neutral amino acids transporter small subunit 1 SLC7A5 hLAT1 | y+ system cationic amino acid transporter
Type:
PROTEIN
Mol. Mass.:
55013.61
Organism:
Homo sapiens (Human)
Description:
ChEMBL_100160
Residue:
507
  
Inhibitor
Name:
BDBM50463321
Synonyms:
CHEMBL4239455
Type:
Small organic molecule
Emp. Form.:
C18H21ClN2O6
Mol. Mass.:
396.822
SMILES:
Cl.N[C@@H](Cc1ccc(OC(=O)NCCc2ccc(O)c(O)c2)cc1)C(O)=O
: