Target
Bromodomain-containing protein 4
Ligand
BDBM50464135
Substrate
Meas. Tech.
ChEMBL_1780008 (CHEMBL4237000)
IC50
5012±n/a nM
Citation
 Bamborough, PChung, CWFurze, RCGrandi, PMichon, AMWatson, RJMitchell, DJBarnett, HPrinjha, RKRau, CSheppard, RJWerner, TDemont, EH Aiming to Miss a Moving Target: Bromo and Extra Terminal Domain (BET) Selectivity in Constrained ATAD2 Inhibitors. J Med Chem 61:8321-8336 (2018)  
Target
Name:
Bromodomain-containing protein 4
Synonyms:
BRD4 Bromodomain-containing protein 4 (BRD4) Protein HUNK1
Type:
Protein
Mol. Mass.:
152264.84
Organism:
Homo sapiens (Human)
Description:
O60885
Residue:
1362
  
Inhibitor
Name:
BDBM50464135
Synonyms:
CHEMBL4246741
Type:
Small organic molecule
Emp. Form.:
C30H38N4O3S
Mol. Mass.:
534.713
SMILES:
[H][C@]12CC[C@]([H])(N1)[C@@H](CCC1CCS(=O)(=O)CC1)[C@@H](C2)Nc1ccc(-c2cncc(C)c2)c2cc(C)c(=O)[nH]c12
: