Target
Matrix protein 2
Ligand
BDBM50216627
Substrate
Meas. Tech.
ChEMBL_1784214 (CHEMBL4255731)
Kd
>10000000±n/a nM
Citation
 Drakopoulos, ATzitzoglaki, CMcGuire, KHoffmann, AKonstantinidi, AKolokouris, DMa, CFreudenberger, KHutterer, JGauglitz, GWang, JSchmidtke, MBusath, DDKolocouris, A Unraveling the Binding, Proton Blockage, and Inhibition of Influenza M2 WT and S31N by Rimantadine Variants. ACS Med Chem Lett 9:198-203 (2018)  
Target
Name:
Matrix protein 2
Synonyms:
M Proton channel protein M2
Type:
PROTEIN
Mol. Mass.:
11180.06
Organism:
Influenza A virus (A/Udorn/307/1972(H3N2))
Description:
ChEMBL_22
Residue:
97
  
Inhibitor
Name:
BDBM50216627
Synonyms:
(alpha-methyl-1-adamantyl)methylamine CHEMBL959 US11241393, Rimantadine rimantidin
Type:
Small organic molecule
Emp. Form.:
C12H21N
Mol. Mass.:
179.3018
SMILES:
CC(N)C12CC3CC(CC(C3)C1)C2
: