Target
17-beta-hydroxysteroid dehydrogenase type 2
Ligand
BDBM50466027
Substrate
Meas. Tech.
ChEMBL_1789612 (CHEMBL4261346)
IC50
1.3±n/a nM
Citation
 Siebenbuerger, LHernandez-Olmos, VAbdelsamie, ASFrotscher, Mvan Koppen, CJMarchais-Oberwinkler, SScheuer, CLaschke, MWMenger, MDBoerger, CHartmann, RW Highly Potent 17?-HSD2 Inhibitors with a Promising Pharmacokinetic Profile for Targeted Osteoporosis Therapy. J Med Chem 61:10724-10738 (2018)  
Target
Name:
17-beta-hydroxysteroid dehydrogenase type 2
Synonyms:
17-beta-Hydroxysteroid Dehydrogenase 2 (17-beta-HSD2) 20-alpha-HSD EDH17B2 Estradiol 17-beta-dehydrogenase 2 (17beta-HSD2) Microsomal 17-beta-hydroxysteroid dehydrogenas Testosterone 17-beta-dehydrogenase
Type:
Oxidoreductase; single-pass type II membrane protein
Mol. Mass.:
42795.29
Organism:
Homo sapiens (Human)
Description:
Enzyme was partially purified from human placenta.
Residue:
387
  
Inhibitor
Name:
BDBM50466027
Synonyms:
CHEMBL4292910
Type:
Small organic molecule
Emp. Form.:
C19H10F3NO2S
Mol. Mass.:
373.348
SMILES:
Oc1c(F)c(F)cc(C(=O)c2ccc(s2)-c2ccc3[nH]ccc3c2)c1F
: