Target
17-beta-hydroxysteroid dehydrogenase type 1
Ligand
BDBM50466010
Substrate
Meas. Tech.
ChEMBL_1789613 (CHEMBL4261347)
IC50
3.1±n/a nM
Citation
 Siebenbuerger, LHernandez-Olmos, VAbdelsamie, ASFrotscher, Mvan Koppen, CJMarchais-Oberwinkler, SScheuer, CLaschke, MWMenger, MDBoerger, CHartmann, RW Highly Potent 17?-HSD2 Inhibitors with a Promising Pharmacokinetic Profile for Targeted Osteoporosis Therapy. J Med Chem 61:10724-10738 (2018)  
Target
Name:
17-beta-hydroxysteroid dehydrogenase type 1
Synonyms:
17-beta-HSD 1 17-beta-hydroxysteroid dehydrogenase type 1 20-alpha-HSD E17KSR EDH17B1 EDHB17 Estradiol 17-beta-dehydrogenase 1 (17beta-HSD1) Placental 17-beta-hydroxysteroid dehydrogenase | SDR28C1
Type:
Enzyme
Mol. Mass.:
34945.13
Organism:
Homo sapiens (Human)
Description:
P14061
Residue:
328
  
Inhibitor
Name:
BDBM50466010
Synonyms:
CHEMBL4286141
Type:
Small organic molecule
Emp. Form.:
C17H8F4O3S
Mol. Mass.:
368.302
SMILES:
Oc1ccc(cc1F)-c1ccc(s1)C(=O)c1cc(F)c(F)c(O)c1F
: