Target
Choline O-acetyltransferase
Ligand
BDBM50026472
Substrate
Meas. Tech.
ChEMBL_27375 (CHEMBL642521)
Ki
25000000±n/a nM
Citation
 Cohen, SGChishti, SBElkind, JLReese, HCohen, JB Effects of charge, volume, and surface on binding of inhibitor and substrate moieties to acetylcholinesterase. J Med Chem 28:1309-13 (1985)  
Target
Name:
Choline O-acetyltransferase
Synonyms:
CLAT_RAT Choline Acetyltransferase Choline acetylase
Type:
Enzyme Catalytic Domain
Mol. Mass.:
71875.58
Organism:
RAT
Description:
Choline Acetyltransferase 0 RAT::P32738
Residue:
640
  
Inhibitor
Name:
BDBM50026472
Synonyms:
(CH3)2SO CHEMBL504 Dimethylsulfoxid US11866416, Compound DMSO dimethyl sulphoxide methylsulfinylmethane | sulfinylbis(methane)
Type:
Small organic molecule
Emp. Form.:
C2H6OS
Mol. Mass.:
78.133
SMILES:
CS(C)=O
: