Target
Lysosomal alpha-glucosidase
Ligand
BDBM50478556
Substrate
Meas. Tech.
ChEMBL_483554 (CHEMBL961145)
IC50
344±n/a nM
Citation
 Nakao, YUehara, TMatsunaga, SFusetani, Nvan Soest, RWMatunaga, S Callyspongynic acid, a polyacetylenic acid which inhibits alpha-glucosidase, from the marine sponge Callyspongia truncata. J Nat Prod 65:922-4 (2002)  
Target
Name:
Lysosomal alpha-glucosidase
Synonyms:
70 kDa lysosomal alpha-glucosidase Acid maltase Alpha glucosidase LYAG_HUMAN
Type:
PROTEIN
Mol. Mass.:
105312.45
Organism:
Homo sapiens (Human)
Description:
ChEMBL_1506060
Residue:
952
  
Inhibitor
Name:
BDBM50478556
Synonyms:
CORTICATIC ACID A
Type:
Small organic molecule
Emp. Form.:
C31H44O3
Mol. Mass.:
464.6793
SMILES:
OC(\C=C\CCCCCC#CC\C=C/CCCCCCCCCCC\C=C/C#CC(O)=O)C#C
: