Target
Similar to alpha-tubulin isoform 1
Ligand
BDBM50060957
Substrate
Meas. Tech.
ChEMBL_211329 (CHEMBL818988)
IC50
12000±n/a nM
Citation
 Goldbrunner, MLoidl, GPolossek, TMannschreck, Avon Angerer, E Inhibition of tubulin polymerization by 5,6-dihydroindolo[2,1-alpha]isoquinoline derivatives. J Med Chem 40:3524-33 (1997)  
Target
Name:
Similar to alpha-tubulin isoform 1
Synonyms:
Similar to alpha-tubulin isoform 1
Type:
PROTEIN
Mol. Mass.:
10383.05
Organism:
Bos taurus
Description:
ChEMBL_104716
Residue:
99
  
Inhibitor
Name:
BDBM50060957
Synonyms:
2-Hydroxyestradol 2-methyl ether CHEMBL299613 | Panzem
Type:
Small organic molecule
Emp. Form.:
C19H26O3
Mol. Mass.:
302.4079
SMILES:
COc1cc2[C@H]3CC[C@]4(C)[C@@H](O)CC[C@H]4[C@@H]3CCc2cc1O
: