Target
Alpha-2A adrenergic receptor
Ligand
BDBM50033111
Substrate
Meas. Tech.
ChEMBL_33206 (CHEMBL643231)
Ki
550±n/a nM
Citation
 Wong, WCChiu, GWetzel, JMMarzabadi, MRNagarathnam, DWang, DFang, JMiao, SWHong, XForray, CVaysse, PJBranchek, TAGluchowski, CTang, RLepor, H Identification of a dihydropyridine as a potent alpha1a adrenoceptor-selective antagonist that inhibits phenylephrine-induced contraction of the human prostate. J Med Chem 41:2643-50 (1998)  
Target
Name:
Alpha-2A adrenergic receptor
Synonyms:
ADA2A_HUMAN ADRA2R Adrenergic alpha2A Alpha-2 adrenergic receptor subtype C10 Alpha-2A adrenoreceptor alpha-2A adrenergic receptor [Homo sapiens]
Type:
Enzyme
Mol. Mass.:
48979.91
Organism:
Homo sapiens (Human)
Description:
P08913
Residue:
450
  
Inhibitor
Name:
BDBM50033111
Synonyms:
1-(4-Amino-6,7-dimethoxy-2-quinazolinyl)-4-((tetrahydro-2-furanyl)carbonyl)piperazine CHEMBL611 Terazosine
Type:
Small organic molecule
Emp. Form.:
C19H25N5O4
Mol. Mass.:
387.4329
SMILES:
COc1cc2nc(nc(N)c2cc1OC)N1CCN(CC1)C(=O)C1CCCO1
: