Target
Sporulation kinase A
Ligand
BDBM50471716
Substrate
Meas. Tech.
ChEMBL_37761 (CHEMBL650776)
IC50
27000±n/a nM
Citation
 Macielag, MJDemers, JPFraga-Spano, SAHlasta, DJJohnson, SGKanojia, RMRussell, RKSui, ZWeidner-Wells, MAWerblood, HFoleno, BDGoldschmidt, RMLoeloff, MJWebb, GCBarrett, JF Substituted salicylanilides as inhibitors of two-component regulatory systems in bacteria. J Med Chem 41:2939-45 (1998)  
Target
Name:
Sporulation kinase A
Synonyms:
KINA_BACSU Stage II sporulation protein F gsiC scoD spoIIJ
Type:
PROTEIN
Mol. Mass.:
69161.05
Organism:
Bacillus subtilis (strain 168)
Description:
ChEMBL_105028
Residue:
606
  
Inhibitor
Name:
BDBM50471716
Synonyms:
CHEMBL431272
Type:
Small organic molecule
Emp. Form.:
C15H7Cl2F6NO2
Mol. Mass.:
418.118
SMILES:
Oc1c(cc(cc1C(F)(F)F)C(F)(F)F)C(=O)Nc1ccc(Cl)c(Cl)c1
: