Target
D(3) dopamine receptor
Ligand
BDBM50474392
Substrate
Meas. Tech.
ChEMBL_62595 (CHEMBL674272)
Ki
2.0±n/a nM
Citation
 Macdonald, GJBranch, CLHadley, MSJohnson, CNNash, DJSmith, ABStemp, GThewlis, KMVong, AKAustin, NEJeffrey, PWinborn, KYBoyfield, IHagan, JJMiddlemiss, DNReavill, CRiley, GJWatson, JMWood, MParker, SGAshby, CR Design and synthesis of trans-3-(2-(4-((3-(3-(5-methyl-1,2,4-oxadiazolyl))- phenyl)carboxamido)cyclohexyl)ethyl)-7-methylsulfonyl-2,3,4,5-tetrahydro-1H-3-benzazepine (SB-414796): a potent and selective dopamine D3 receptor antagonist. J Med Chem 46:4952-64 (2003)  
Target
Name:
D(3) dopamine receptor
Synonyms:
DOPAMINE D3 DRD3_HUMAN Dopamine D3 receptor (D3) Dopamine receptor Dopamine receptor D3
Type:
Mol. Mass.:
44243.43
Organism:
Homo sapiens (Human)
Description:
Residue:
400
  
Inhibitor
Name:
BDBM50474392
Synonyms:
CHEMBL3084601
Type:
Small organic molecule
Emp. Form.:
C30H37ClN4O4S
Mol. Mass.:
585.157
SMILES:
Cl.CS(=O)(=O)Oc1ccc2CCN(CC[C@H]3CC[C@@H](CC3)NC(=O)c3cccc(c3)-c3ncccn3)CCc2c1
: